{"text_format":"1","workbook":"xlsx","n_sheets":2,"sheets":["所見_元","個別_所見"],"not_rendered":{"charts":0,"images":0,"macros":1,"external_links":0,"defined_names":0,"comments":0,"pivot_tables":0},"unopened":[],"bounds":{"document_bytes":16777216,"sheet_cells":100000,"rows_first":2000,"rows_last":500,"rows_between":2000,"halvings":0,"cell_chars":16384,"cell_head_chars":4096},"cells_cut":0,"cells_raw":0,"read":"whole","date_system":"1900"}

{"sheet":"所見_元","index":0,"n_rows":9,"n_cols":6,"rows_kept":9,"cut":false,"hidden":false,"merged":[]}
[]
[null,null,"番号","名前","所見","文字数"]
[null,null,1,"石田　拓海","クラスのムードメーカーで明るくゆかいなのでクラスのだれとでもなかよくできるところがあります。また、こまっている友だちにも　サッと声をかけてあげられる所もいいですね。さらに自分の気持ちをもっと本音で出せるようになると良いです。(12/21）",{"$f":"LEN($E3)","v":119}]
[null,null,2,"伊藤　愛美","漢字の学習にきちっと取り組みたくさんの漢字をおぼえていっています。努力家です。やさしい気持ちの持ち主なので友だちにもしんらいされています。（12/21）",{"$f":"LEN($E4)","v":76}]
[null,null,3,"上杉　空","たとえイヤことがあって気分が落ちこんでも自分ですぐに元気をとりもどせています。いつも、前向きでクラスのことも考えてくれていますね。係でもないのに友だちといっしょうけんめい放課後、残ってそうじをしてくれました。ありがとう。感謝しています。（12/21）",125]
[null,null,4,"上戸　麻衣子","どの教科もむらなく真剣に取り組みました。学習に対する集中力にはすばらしいものがあります。根気のよい努力が学習の成果に結びついています。３学期もがんばりましょう（12/21）",86]
[null,null,5,"大石　心","グループ学習では，自分の考えを発表するとともに、友だちの考えを受け入れて計画を立てていました。その結果，実際の学習でも協力して取り組み，思いどおりの学習ができていました。また、学級活動においてどんなお楽しみ会ならみんなが楽しめるかを考えて，たくさんのアイディアを発表してみんなが感心していましたね（12/21）",155]
[null,null,6,"大久保　陸","友だちと関わる時は自分だけでなく，友だちのことも考えて計画を立てようとする姿勢は，たいへんすばらしいと思います。（12/21）",63]
[null,null,7,"大阪　太郎","朝は「おはようございます」の元気な声とともに，教室に入ってきます。明るくさわやかなあいさつや言葉遣いは，クラスの友達の手本になっています。また「ありがとう」「ごめんなさい」がしっかり言えます。友だちとよりよい関係を築くうえで大切なことです。(12/21)",127]

{"sheet":"個別_所見","index":1,"n_rows":17,"n_cols":8,"rows_kept":17,"cut":false,"hidden":false,"merged":[[1,6,1,7],[2,6,2,7],[4,1,4,2],[12,1,12,2]]}
[]
[null,"番号","名前",null,null,"所見","文字数"]
[null,0,{"$f":"VLOOKUP($B$3,所見_元!$C$3:$F$9,2,FALSE)","v":{"$error":"#N/A"}},null,null,{"$f":"VLOOKUP($B$3,所見_元!$C$3:$F$9,3,FALSE)","v":{"$error":"#N/A"}},{"$f":"VLOOKUP($B$3,所見_元!$C$3:$F$9,4,FALSE)","v":{"$error":"#N/A"}}]
[]
[null,"文字数 40~160",null,null,"先生から"]
[]
[]
[]
[null,0,"文字が下の行にある"]
[null,null,null,null,null,null,null,{"$f":"LEN(F10)","v":0}]
[null,7,"フォントサイズ"]
[]
[]
[]
[]
[]
[null,null,null,null,null,null,null,{"$f":"LEN(F17)","v":0}]