{"text_format":"1","workbook":"xlsx","n_sheets":12,"sheets":["名簿_連絡","連絡袋_表","連絡袋_裏","名簿_角2","角形2号","名簿_長3","長形3号","名簿_長4","長形4号","名簿_角8","角形8号","予備"],"not_rendered":{"charts":0,"images":14,"macros":1,"external_links":0,"defined_names":12,"comments":0,"pivot_tables":0},"unopened":[],"bounds":{"document_bytes":16777216,"sheet_cells":100000,"rows_first":2000,"rows_last":500,"rows_between":2000,"halvings":0,"cell_chars":16384,"cell_head_chars":4096},"cells_cut":0,"cells_raw":0,"read":"whole","date_system":"1900"}

{"sheet":"名簿_連絡","index":0,"n_rows":45,"n_cols":12,"rows_kept":45,"cut":false,"hidden":false,"merged":[[12,4,14,7],[6,6,6,9]]}
[1,"石田　愛美"]
[2,"伊藤　望結",null,null,"年度",{"$f":"IF(MONTH(TODAY())<4,YEAR(TODAY())-1,YEAR(TODAY()))","v":2018}]
[3,"上杉　工",null,null,"平成",{"$f":"F2-1988","v":30}]
[4,"上戸　架純",null,null,"学校名","エクセル小"]
[5,"大石　心",null,null,"学年",6]
[6,"大久保　征悦",null,null,"クラス名",1]
[7,"大阪　太郎",null,null,"クラス人数",{"$f":"COUNTA($B$1:$B$42)","v":40},"←名前が入ると自動的に人数が出ます"]
[8,"織田　翼"]
[9,"菅野　結菜",null,null,"子どもの番号",14,"←実際に印刷する子どもの番号（マクロで自動的に変化）"]
[10,"木戸　くるみ"]
[11,"木下　悠吾"]
[12,"国仲　海斗"]
[13,"熊田　涼太",null,null,"連絡袋　表と裏　A5サイズ"]
[14,"栗山　綾乃",null,null,null,null,null,null,null,"表",null,"裏"]
[15,"小池　優衣"]
[16,"小松　健太"]
[17,"近藤　優輝"]
[18,"西郷　啓太"]
[19,"坂本　愛莉"]
[20,"佐藤　琴音"]
[21,"篠原　翔"]
[22,"柴咲　真理"]
[23,"島田　美優"]
[24,"瀬戸　真央"]
[25,"高杉　芽衣"]
[26,"武田　太一"]
[27,"遠山　蒼太"]
[28,"徳川　大輝"]
[29,"長澤　美緒"]
[30,"夏木　彩音"]
[31,"野田　健太"]
[32,"平賀　真衣"]
[33,"広末　未来"]
[34,"深田　雄太"]
[35,"福沢　陽太"]
[36,"堀北　美由紀"]
[37,"松尾　歩"]
[38,"眞鍋　あかり"]
[39,"宮﨑　遥"]
[40,"宮本　瑛大"]
[41]
[42]
[43]
[44]
[45]

{"sheet":"連絡袋_表","index":1,"n_rows":43,"n_cols":18,"rows_kept":43,"cut":false,"hidden":false,"merged":[[2,5,3,6],[5,2,6,6],[5,17,5,26],[42,13,43,17],[2,2,3,3]]}
[]
[]
[null,null,{"$f":"名簿_連絡!F3","v":30},null,null,{"$f":"名簿_連絡!F2","v":2018}]
[]
[]
[null,null,{"$f":"子どもの番号","v":14},null,null,null,null,null,null,null,null,{"$f":"学年","v":6},null,{"$f":"クラス名","v":1},null,null,null,{"$f":"VLOOKUP(子どもの番号,名簿_連絡!$A$1:$B$42,2,FALSE)&\"\"","v":"栗山　綾乃"}]
[]
[]
[]
[]
[]
[]
[]
[]
[]
[]
[]
[]
[]
[]
[]
[]
[]
[]
[]
[]
[]
[]
[]
[]
[]
[]
[]
[]
[]
[]
[]
[]
[]
[]
[]
[]
[null,null,null,null,null,null,null,null,null,null,null,null,null,{"$f":"名簿_連絡!F4","v":"エクセル小"}]

{"sheet":"連絡袋_裏","index":2,"n_rows":18,"n_cols":18,"rows_kept":18,"cut":false,"hidden":false,"merged":[[2,2,3,2],[42,13,43,17],[3,5,3,6],[7,6,7,16],[7,17,7,22],[3,16,3,25],[8,6,8,16],[8,17,8,22],[9,6,9,16],[9,17,9,22],[10,6,10,16],[10,17,10,22],[11,6,11,16],[11,17,11,22],[12,6,12,16],[12,17,12,22],[13,6,13,16],[13,17,13,22],[14,6,14,16],[14,17,14,22],[15,6,15,16],[15,17,15,22],[16,6,16,16],[16,17,16,22],[17,6,17,16],[17,17,17,22],[18,6,18,16],[18,17,18,22],[19,6,19,16],[19,17,19,22],[20,6,20,16],[20,17,20,22],[21,6,21,16],[21,17,21,22]]}
[]
[]
[]
[null,null,null,null,null,{"$f":"子どもの番号","v":14},null,null,null,null,null,null,null,null,null,null,{"$f":"VLOOKUP(子どもの番号,名簿_連絡!$A$1:$B$42,2,FALSE)&\"\"","v":"栗山　綾乃"}]
[]
[null,null,2]
[]
[null,null,null,null,4,null,"学級費や教材費",null,null,null,null,null,null,null,null,null,null,300]
[null,null,null,null,5,null,"学級費や教材費",null,null,null,null,null,null,null,null,null,null,300]
[null,null,null,null,6,null,"学級費や教材費",null,null,null,null,null,null,null,null,null,null,300]
[null,null,null,null,7,null,"学級費や教材費",null,null,null,null,null,null,null,null,null,null,300]
[null,null,null,null,"8/9",null,"学級費や教材費",null,null,null,null,null,null,null,null,null,null,300]
[null,null,null,null,10,null,"学級費や教材費",null,null,null,null,null,null,null,null,null,null,300]
[null,null,null,null,11,null,"学級費や教材費",null,null,null,null,null,null,null,null,null,null,300]
[null,null,null,null,12,null,"学級費や教材費",null,null,null,null,null,null,null,null,null,null,300]
[null,null,null,null,1,null,"学級費や教材費",null,null,null,null,null,null,null,null,null,null,300]
[null,null,null,null,2,null,"学級費や教材費",null,null,null,null,null,null,null,null,null,null,300]
[null,null,null,null,3,null,"学級費や教材費",null,null,null,null,null,null,null,null,null,null,300]

{"sheet":"名簿_角2","index":3,"n_rows":44,"n_cols":9,"rows_kept":44,"cut":false,"hidden":false,"merged":[]}
["No.","名前","郵便番号","住所"]
[1,"石田　愛美",1234567,"便利東町2-10-6-2109",null,"年度",{"$f":"IF(MONTH(TODAY())<4,YEAR(TODAY())-1,YEAR(TODAY()))","v":2018}]
[2,"伊藤　望結",null,null,null,"平成",{"$f":"G2-1988","v":30}]
[3,"上杉　工"]
[4,"上戸　架純",null,null,null,"学年",2]
[5,"大石　心",null,null,null,"クラス名",1]
[6,"大久保　征悦",null,null,null,"クラス人数",{"$f":"COUNTA(B2:B44)","v":40},"←","名前が入ると自動的に人数が出ます"]
[7,"大阪　太郎"]
[8,"織田　翼"]
[9,"菅野　結菜"]
[10,"木戸　くるみ",1234568,"楽々町2-8-11-1234"]
[11,"木下　悠吾"]
[12,"国仲　海斗"]
[13,"熊田　涼太"]
[14,"栗山　綾乃"]
[15,"小池　優衣"]
[16,"小松　健太"]
[17,"近藤　優輝"]
[18,"西郷　啓太"]
[19,"坂本　愛莉"]
[20,"佐藤　琴音"]
[21,"篠原　翔"]
[22,"柴咲　真理"]
[23,"島田　美優"]
[24,"瀬戸　真央"]
[25,"高杉　芽衣"]
[26,"武田　太一"]
[27,"遠山　蒼太"]
[28,"徳川　大輝"]
[29,"長澤　美緒"]
[30,"夏木　彩音"]
[31,"野田　健太"]
[32,"平賀　真衣"]
[33,"広末　未来"]
[34,"深田　雄太"]
[35,"福沢　陽太"]
[36,"堀北　美由紀"]
[37,"松尾　歩"]
[38,"眞鍋　あかり"]
[39,"宮﨑　遥"]
[40,"宮本　瑛大"]
[41]
[42]
[43]

{"sheet":"角形2号","index":4,"n_rows":28,"n_cols":54,"rows_kept":28,"cut":false,"hidden":false,"merged":[[2,2,3,2],[2,5,3,6],[10,9,15,37],[23,12,25,14],[23,15,25,17],[23,18,25,20],[23,21,25,23],[23,24,25,26],[23,27,25,29],[3,40,5,41],[23,3,25,7],[23,8,25,10],[27,13,30,35],[47,15,49,21],[47,24,49,38],[3,28,5,29],[3,30,5,31],[3,32,5,33],[3,34,5,35],[3,36,5,37],[3,38,5,39]]}
[null,null,null,null,null,null,null,null,null,null,null,null,null,null,null,null,null,null,null,null,null,null,null,null,null,null,null,null,null,null,null,null,null,null,null,null,null,null,null,null,null,null,null,null,null,null,null,null,null,null,null,null,"印刷する人のNo",{"$f":"子どもの番号","v":14}]
[]
[null,null,null,null,null,null,null,null,null,null,null,null,null,null,null,null,null,null,null,null,null,null,null,null,null,null,null,null,null,null,null,null,null,null,null,null,null,null,null,null,null,null,null,null,null,null,null,null,null,null,null,null,"郵便番号",{"$f":"VLOOKUP($BB$1,名簿_角2!$A$1:$D$42,3,FALSE)&\"\"","v":""}]
[null,null,null,null,null,null,null,null,null,null,null,null,null,null,null,null,null,null,null,null,null,null,null,null,null,null,null,null,{"$f":"MID($BB$3,1,1)","v":""},null,{"$f":"MID($BB$3,2,1)","v":""},null,{"$f":"MID($BB$3,3,1)","v":""},null,{"$f":"MID($BB$3,4,1)","v":""},null,{"$f":"MID($BB$3,5,1)","v":""},null,{"$f":"MID($BB$3,6,1)","v":""},null,{"$f":"MID($BB$3,7,1)","v":""},null,null,null,null,null,null,null,null,null,null,null,"住所",{"$f":"VLOOKUP($BB$1,名簿_角2!$A$1:$D$42,4,FALSE)&\"\"","v":""}]
[null,null,null,null,null,null,null,null,null,null,null,null,null,null,null,null,null,null,null,null,null,null,null,null,null,null,null,null,null,null,null,null,null,null,null,null,null,null,null,null,null,null,null,null,null,null,null,null,null,null,null,null,"名前",{"$f":"VLOOKUP($BB$1,名簿_角2!$A$1:$D$42,2,FALSE)&\"\"","v":"栗山　綾乃"}]
[]
[]
[]
[]
[]
[null,null,null,null,null,null,null,null,null,"アンケート　書類"]
[]
[]
[]
[]
[]
[]
[]
[]
[]
[]
[]
[]
[null,null,null,{"$f":"名簿_角2!G2","v":2018},null,null,null,null,"年度",null,null,null,{"$f":"名簿_角2!G5","v":2},null,null,"年",null,null,{"$f":"名簿_角2!G6","v":1},null,null,"組",null,null,{"$f":"子どもの番号","v":14},null,null,"番"]
[]
[]
[]
[null,null,null,null,null,null,null,null,null,null,null,null,null,{"$f":"BB5","v":"栗山　綾乃"}]

{"sheet":"名簿_長3","index":5,"n_rows":44,"n_cols":9,"rows_kept":44,"cut":false,"hidden":false,"merged":[[5,8,7,11]]}
["No.","名前","ふりがな","性別","郵便番号","住所"]
[1,"石田　愛美","いしだ　あいみ","女",1234567,"便利東町2-10-6-2109"]
[2,"伊藤　望結","いとう　みゆ","女",1234567,"便利本町3-15-1-2123"]
[3,"上杉　工","うえすぎ　たくみ","男",1234567,"便利本町5-2-1-1234"]
[4,"上戸　架純","うえと　かすみ","女",1234567,"便利本町3-10-1-1098"]
[5,"大石　心","おおいし　しん","男",1234567,"便利本町5-1-38-4034",null,null,"長形3号　表のみ"]
[6,"大久保　征悦","おおくぼ　ゆきよし","男",1234567,"便利本町5-2-6-1123"]
[7,"大阪　太郎","おおさか　たろう","男",1234567,"便利東町2-10-1-1234"]
[8,"織田　翼","おだ　つばさ","男",1234567,"便利東町5-16-17-1234"]
[9,"菅野　結菜","かんの　ゆうな","女",1234567,"便利東町6-5-4-4321"]
[10,"木戸　くるみ","きど　くるみ","女",1234568,"楽々町2-8-11-1234"]
[11,"木下　悠吾","きのした　ゆうご","男",1234567,"便利東町6-5-3-0987"]
[12,"国仲　海斗","くになか　かいと","男",1234567,"便利元町2-4-15-2109"]
[13,"熊田　涼太","くまだ　りょうた","男",1234567,"便利本町2-7-2109"]
[14,"栗山　綾乃","くりやま　あやの","女",1234567,"便利本町2-6-1234"]
[15,"小池　優衣","こいけ　ゆい","女",1234567,"便利本町5-2-3-1098"]
[16,"小松　健太","こまつ　けんた","男",1234567,"便利本町2-5-9876"]
[17,"近藤　優輝","こんどう　ゆうき","男",1234567,"便利東町2-6-1789"]
[18,"西郷　啓太","さいごう　けいた","男",1234567,"便利本町1-2-1234"]
[19,"坂本　愛莉","さかもと　あいり","女",1234567,"便利本町3-1-1123"]
[20,"佐藤　琴音","さとう　ことね","女",1234567,"便利本町1-4-1-2109"]
[21,"篠原　翔","しのはら　しょう","男",1234568,"楽々町2-6-7890"]
[22,"柴咲　真理","しばざき　まり","女",1234567,"便利本町5-2-1-4321"]
[23,"島田　美優","しまだ　みゆ","女",1234567,"便利東町2-7-22-4321"]
[24,"瀬戸　真央","せと　まお","女",1234567,"便利本町1-5-2109"]
[25,"高杉　芽衣","たかすぎ　めい","女",1234567,"便利元町2-13-14-2345"]
[26,"武田　太一","たけだ　たいち","男",1234568,"楽々町1-3-7-2109"]
[27,"遠山　蒼太","とおやま　そうた","男",1234567,"便利東町2-7-1234"]
[28,"徳川　大輝","とくがわ　たいき","男",1234567,"便利元町2-12-8769"]
[29,"長澤　美緒","ながさわ　みお","女",1234567,"便利東町6-5-3-1231"]
[30,"夏木　彩音","なつき　あやね","女",1234567,"便利東町6-5-5-5432"]
[31,"野田　健太","のだ　けんた","男",1234567,"便利本町3-12-23-1234"]
[32,"平賀　真衣","ひらが　まい","女",1234568,"楽々町1-12-9876"]
[33,"広末　未来","ひろすえ　みらい","女",1234567,"便利東町2-5-6543"]
[34,"深田　雄太","ふかだ　ゆうた","男",1234567,"便利元町2-1-14-3456"]
[35,"福沢　陽太","ふくざわ　ようた","男",1234567,"便利元町2-4-15-1098"]
[36,"堀北　美由紀","ほりきた　みゆき","女",1234567,"便利本町3-7-1234"]
[37,"松尾　歩","まつお　あゆむ","男",1234567,"便利本町5-2-4-1098"]
[38,"眞鍋　あかり","まなべ　あかり","女",1234567,"便利本町3-13-13-1098"]
[39,"宮﨑　遥","みやざき　はるか","女",1234567,"便利東町5-5-1234"]
[40,"宮本　瑛大","みやもと　えいた","男",1234567,"便利東町5-10-25-3456"]
[41]
[42]
[43]

{"sheet":"長形3号","index":6,"n_rows":6,"n_cols":74,"rows_kept":6,"cut":false,"hidden":false,"merged":[[15,54,16,55],[2,2,3,2],[42,13,43,17],[2,14,3,14],[2,15,3,15],[2,16,3,16],[2,17,3,17],[2,18,3,18],[2,12,3,12],[2,13,3,13]]}
[null,null,null,null,null,null,null,null,null,null,null,null,null,null,null,null,null,null,null,null,null,null,null,null,null,null,"印刷する人のNo",{"$f":"子どもの番号","v":14}]
[null,null,null,null,null,null,null,null,null,null,null,null,null,null,null,null,null,null,null,null,null,null,null,null,null,null,null,null,null,null,null,null,null,null,null,null,null,null,null,null,null,null,null,null,null,null,null,null,null,null,null,null,null,null,null,null,null,null,null,null,null,null,null,null,null,null,null,null,null,null,null,null,null,5]
[null,null,null,null,null,null,null,null,null,null,null,null,{"$f":"LEFT($AB$3,1)","v":"1"},{"$f":"MID($AB$3,2,1)","v":"2"},{"$f":"MID($AB$3,3,1)","v":"3"},{"$f":"MID($AB$3,4,1)","v":"4"},{"$f":"MID($AB$3,5,1)","v":"5"},{"$f":"MID($AB$3,6,1)","v":"6"},{"$f":"RIGHT($AB$3,1)","v":"7"},null,null,null,null,null,null,null,"郵便番号",{"$f":"VLOOKUP($AB$1,名簿_長3!$A$1:$F$42,5,FALSE)&\"\"","v":"1234567"}]
[null,null,null,null,null,null,null,null,null,null,null,null,null,null,null,null,null,null,null,null,null,null,null,null,null,null,"住所",{"$f":"VLOOKUP($AB$1,名簿_長3!$A$1:$F$42,6,FALSE)&\"\"","v":"便利本町2-6-1234"}]
[null,null,null,null,null,null,null,null,null,null,null,null,null,null,null,null,null,null,null,null,null,null,null,null,null,null,"名前",{"$f":"VLOOKUP($AB$1,名簿_長3!$A$1:$B$42,2,FALSE)&\"\"","v":"栗山　綾乃"}]
[null,null,2]

{"sheet":"名簿_長4","index":7,"n_rows":44,"n_cols":9,"rows_kept":44,"cut":false,"hidden":false,"merged":[[5,8,7,11]]}
["No.","名前","ふりがな","性別","郵便番号","住所"]
[1,"石田　愛美","いしだ　あいみ","女",1234567,"便利東町2-10-6-2109"]
[2,"伊藤　望結","いとう　みゆ","女",1234567,"便利本町3-15-1-2123"]
[3,"上杉　工","うえすぎ　たくみ","男",1234567,"便利本町5-2-1-1234"]
[4,"上戸　架純","うえと　かすみ","女",1234567,"便利本町3-10-1-1098"]
[5,"大石　心","おおいし　しん","男",1234567,"便利本町5-1-38-4034",null,null,"長形　小封筒　表のみ"]
[6,"大久保　征悦","おおくぼ　ゆきよし","男",1234567,"便利本町5-2-6-1123"]
[7,"大阪　太郎","おおさか　たろう","男",1234567,"便利東町2-10-1-1234"]
[8,"織田　翼","おだ　つばさ","男",1234567,"便利東町5-16-17-1234"]
[9,"菅野　結菜","かんの　ゆうな","女",1234567,"便利東町6-5-4-4321"]
[10,"木戸　くるみ","きど　くるみ","女",1234568,"楽々町2-8-11-1234"]
[11,"木下　悠吾","きのした　ゆうご","男",1234567,"便利東町6-5-3-0987"]
[12,"国仲　海斗","くになか　かいと","男",1234567,"便利元町2-4-15-2109"]
[13,"熊田　涼太","くまだ　りょうた","男",1234567,"便利本町2-7-2109"]
[14,"栗山　綾乃","くりやま　あやの","女",1234567,"便利本町2-6-1234"]
[15,"小池　優衣","こいけ　ゆい","女",1234567,"便利本町5-2-3-1098"]
[16,"小松　健太","こまつ　けんた","男",1234567,"便利本町2-5-9876"]
[17,"近藤　優輝","こんどう　ゆうき","男",1234567,"便利東町2-6-1789"]
[18,"西郷　啓太","さいごう　けいた","男",1234567,"便利本町1-2-1234"]
[19,"坂本　愛莉","さかもと　あいり","女",1234567,"便利本町3-1-1123"]
[20,"佐藤　琴音","さとう　ことね","女",1234567,"便利本町1-4-1-2109"]
[21,"篠原　翔","しのはら　しょう","男",1234568,"楽々町2-6-7890"]
[22,"柴咲　真理","しばざき　まり","女",1234567,"便利本町5-2-1-4321"]
[23,"島田　美優","しまだ　みゆ","女",1234567,"便利東町2-7-22-4321"]
[24,"瀬戸　真央","せと　まお","女",1234567,"便利本町1-5-2109"]
[25,"高杉　芽衣","たかすぎ　めい","女",1234567,"便利元町2-13-14-2345"]
[26,"武田　太一","たけだ　たいち","男",1234568,"楽々町1-3-7-2109"]
[27,"遠山　蒼太","とおやま　そうた","男",1234567,"便利東町2-7-1234"]
[28,"徳川　大輝","とくがわ　たいき","男",1234567,"便利元町2-12-8769"]
[29,"長澤　美緒","ながさわ　みお","女",1234567,"便利東町6-5-3-1231"]
[30,"夏木　彩音","なつき　あやね","女",1234567,"便利東町6-5-5-5432"]
[31,"野田　健太","のだ　けんた","男",1234567,"便利本町3-12-23-1234"]
[32,"平賀　真衣","ひらが　まい","女",1234568,"楽々町1-12-9876"]
[33,"広末　未来","ひろすえ　みらい","女",1234567,"便利東町2-5-6543"]
[34,"深田　雄太","ふかだ　ゆうた","男",1234567,"便利元町2-1-14-3456"]
[35,"福沢　陽太","ふくざわ　ようた","男",1234567,"便利元町2-4-15-1098"]
[36,"堀北　美由紀","ほりきた　みゆき","女",1234567,"便利本町3-7-1234"]
[37,"松尾　歩","まつお　あゆむ","男",1234567,"便利本町5-2-4-1098"]
[38,"眞鍋　あかり","まなべ　あかり","女",1234567,"便利本町3-13-13-1098"]
[39,"宮﨑　遥","みやざき　はるか","女",1234567,"便利東町5-5-1234"]
[40,"宮本　瑛大","みやもと　えいた","男",1234567,"便利東町5-10-25-3456"]
[41]
[42]
[43]

{"sheet":"長形4号","index":8,"n_rows":6,"n_cols":28,"rows_kept":6,"cut":false,"hidden":false,"merged":[[3,14,4,14],[3,15,4,15],[3,16,4,16],[2,2,3,2],[3,10,4,10],[3,11,4,11],[3,12,4,12],[3,13,4,13]]}
[null,null,null,null,null,null,null,null,null,null,null,null,null,null,null,null,null,null,null,null,null,null,null,null,null,null,null,{"$f":"子どもの番号","v":14}]
[]
[null,null,null,null,null,null,null,null,null,null,null,null,null,null,null,null,null,null,null,null,null,null,null,null,null,null,"郵便番号",{"$f":"VLOOKUP($AB$1,名簿_長4!$A$1:$F$42,5,FALSE)&\"\"","v":"1234567"}]
[null,null,null,null,null,null,null,null,null,null,{"$f":"LEFT($AB$3,1)","v":"1"},{"$f":"MID($AB$3,2,1)","v":"2"},{"$f":"MID($AB$3,3,1)","v":"3"},{"$f":"MID($AB$3,4,1)","v":"4"},{"$f":"MID($AB$3,5,1)","v":"5"},{"$f":"MID($AB$3,6,1)","v":"6"},{"$f":"RIGHT($AB$3,1)","v":"7"},null,null,null,null,null,null,null,null,null,"住所",{"$f":"VLOOKUP($AB$1,名簿_長4!$A$1:$F$42,6,FALSE)&\"\"","v":"便利本町2-6-1234"}]
[null,null,null,null,null,null,null,null,null,null,null,null,null,null,null,null,null,null,null,null,null,null,null,null,null,null,"名前",{"$f":"VLOOKUP($AB$1,名簿_長4!$A$1:$B$42,2,FALSE)&\"\"","v":"栗山　綾乃"}]
[null,null,2]

{"sheet":"名簿_角8","index":9,"n_rows":44,"n_cols":15,"rows_kept":44,"cut":false,"hidden":false,"merged":[[8,6,10,9]]}
["No.","名前","ふりがな","性別"]
[1,"石田　愛美","いしだ　あいみ","女",null,null,"年度",{"$f":"YEAR(TODAY())","v":2018},null,null,null,null,"平成",{"$f":"TEXT(TODAY(),\"e\")","v":"30"},"年度"]
[2,"伊藤　望結","いとう　みゆ","女"]
[3,"上杉　工","うえすぎ　たくみ","男"]
[4,"上戸　架純","うえと　かすみ","女",null,null,"月謝",2000]
[5,"大石　心","おおいし　しん","男"]
[6,"大久保　征悦","おおくぼ　ゆきよし","男"]
[7,"大阪　太郎","おおさか　たろう","男"]
[8,"織田　翼","おだ　つばさ","男",null,null,"角形８号　表のみ"]
[9,"菅野　結菜","かんの　ゆうな","女"]
[10,"木戸　くるみ","きど　くるみ","女"]
[11,"木下　悠吾","きのした　ゆうご","男"]
[12,"国仲　海斗","くになか　かいと","男"]
[13,"熊田　涼太","くまだ　りょうた","男"]
[14,"栗山　綾乃","くりやま　あやの","女"]
[15,"小池　優衣","こいけ　ゆい","女"]
[16,"小松　健太","こまつ　けんた","男"]
[17,"近藤　優輝","こんどう　ゆうき","男"]
[18,"西郷　啓太","さいごう　けいた","男"]
[19,"坂本　愛莉","さかもと　あいり","女"]
[20,"佐藤　琴音","さとう　ことね","女"]
[21,"篠原　翔","しのはら　しょう","男"]
[22,"柴咲　真理","しばざき　まり","女"]
[23,"島田　美優","しまだ　みゆ","女"]
[24,"瀬戸　真央","せと　まお","女"]
[25,"高杉　芽衣","たかすぎ　めい","女"]
[26,"武田　太一","たけだ　たいち","男"]
[27,"遠山　蒼太","とおやま　そうた","男"]
[28,"徳川　大輝","とくがわ　たいき","男"]
[29,"長澤　美緒","ながさわ　みお","女"]
[30,"夏木　彩音","なつき　あやね","女"]
[31,"野田　健太","のだ　けんた","男"]
[32,"平賀　真衣","ひらが　まい","女"]
[33,"広末　未来","ひろすえ　みらい","女"]
[34,"深田　雄太","ふかだ　ゆうた","男"]
[35,"福沢　陽太","ふくざわ　ようた","男"]
[36,"堀北　美由紀","ほりきた　みゆき","女"]
[37,"松尾　歩","まつお　あゆむ","男"]
[38,"眞鍋　あかり","まなべ　あかり","女"]
[39,"宮﨑　遥","みやざき　はるか","女"]
[40,"宮本　瑛大","みやもと　えいた","男"]
[41]
[42]
[43]

{"sheet":"角形8号","index":10,"n_rows":29,"n_cols":28,"rows_kept":29,"cut":false,"hidden":false,"merged":[[2,2,3,2],[42,13,43,17],[5,24,5,26],[3,11,4,15]]}
[null,null,null,null,null,null,null,null,null,null,null,null,null,null,null,null,null,null,null,null,null,null,null,null,null,null,null,{"$f":"子どもの番号","v":14}]
[]
[null,null,null,null,null,null,null,null,null,null,null,null,null,null,null,null,null,null,null,null,null,null,null,null,null,null,"名前",{"$f":"VLOOKUP($AB$1,名簿_角8!$A$1:$B$42,2,FALSE)&\"\"","v":"栗山　綾乃"}]
[null,null,null,null,null,null,null,null,null,null,null,"授　業　料"]
[]
[null,null,2]
[]
[]
[]
[]
[]
[]
[]
[]
[]
[null,null,null,null,null,null,null,null,null,null,null,4,null,5,null,6]
[]
[]
[]
[null,null,null,null,null,null,null,null,null,null,null,7,null,8,null,9]
[]
[]
[]
[null,null,null,null,null,null,null,null,null,null,null,10,null,11,null,12]
[]
[]
[]
[]
[null,null,null,null,null,null,null,null,null,null,null,1,null,2,null,3]

{"sheet":"予備","index":11,"n_rows":6,"n_cols":3,"rows_kept":6,"cut":false,"hidden":false,"merged":[[2,2,3,2],[42,13,43,17]]}
[]
[]
[]
[]
[]
[null,null,2]