{"text_format":"1","workbook":"xlsx","n_sheets":2,"sheets":["名簿","連絡袋"],"not_rendered":{"charts":0,"images":1,"macros":1,"external_links":0,"defined_names":8,"comments":0,"pivot_tables":0},"unopened":[],"bounds":{"document_bytes":16777216,"sheet_cells":100000,"rows_first":2000,"rows_last":500,"rows_between":2000,"halvings":0,"cell_chars":16384,"cell_head_chars":4096},"cells_cut":0,"cells_raw":0,"read":"whole","date_system":"1900"}

{"sheet":"名簿","index":0,"n_rows":45,"n_cols":9,"rows_kept":45,"cut":false,"hidden":false,"merged":[[10,4,12,7]]}
[1,"石田　拓海",null,null,"年度",{"$f":"YEAR(TODAY())","v":2024}]
[2,"伊藤　愛美",null,null,"令和",{"$f":"TEXT(TODAY(),\"e\")","v":"6"}]
[3,"上杉　空",null,null,"学校名","エクセル小"]
[4,"上戸　麻衣子",null,null,"学年",7]
[5,"大石　心",null,null,"クラス名",1]
[6,"大久保　陸",null,null,"クラス人数",{"$f":"COUNTA($B$1:$B$42)","v":40}]
[7,"大阪　太郎",null,null,null,"↑"]
[8,"織田　翼",null,null,null,"名前が入ると自動的に人数が出ます"]
[9,"菅野　結菜"]
[10,"木戸　くるみ"]
[11,"木下　悠吾",null,null,"連絡袋　表のみ"]
[12,"国仲　海斗"]
[13,"熊田　涼太"]
[14,"栗山　綾乃"]
[15,"小池　優衣"]
[16,"小松　健太"]
[17,"近藤　優輝"]
[18,"西郷　啓太"]
[19,"坂本　愛莉"]
[20,"佐藤　琴音",null,null,null,null,null,"プレビューか印刷","プレビュー"]
[21,"篠原　翔"]
[22,"柴咲　真理"]
[23,"島田　美優"]
[24,"瀬戸　真央"]
[25,"高杉　芽衣"]
[26,"武田　太一"]
[27,"遠山　蒼太"]
[28,"徳川　大輝"]
[29,"長澤　美緒"]
[30,"夏木　彩音"]
[31,"野田　健太"]
[32,"平賀　真衣"]
[33,"広末　未来"]
[34,"深田　雄太"]
[35,"福沢　陽太"]
[36,"堀北　美由紀"]
[37,"松尾　歩"]
[38,"眞鍋　あかり"]
[39,"宮﨑　遥"]
[40,"宮本　瑛大"]
[41]
[42]
[43]
[44]
[45]

{"sheet":"連絡袋","index":1,"n_rows":43,"n_cols":18,"rows_kept":43,"cut":false,"hidden":false,"merged":[[42,13,43,17],[5,17,5,26],[2,2,3,2],[2,5,3,6],[5,2,6,6]]}
[]
[]
[null,null,{"$f":"名簿!F2","v":"6"},null,null,{"$f":"名簿!F1","v":2024}]
[]
[]
[null,null,10,null,null,null,null,null,null,null,null,{"$f":"学年","v":7},null,{"$f":"クラス名","v":1},null,null,null,{"$f":"VLOOKUP($C$6,名簿!$A$1:$B$42,2,FALSE)","v":"木戸　くるみ"}]
[]
[]
[]
[]
[]
[]
[]
[]
[]
[]
[]
[]
[]
[]
[]
[]
[]
[]
[]
[]
[]
[]
[]
[]
[]
[]
[]
[]
[]
[]
[]
[]
[]
[]
[]
[]
[null,null,null,null,null,null,null,null,null,null,null,null,null,{"$f":"名簿!F3","v":"エクセル小"}]